{"text_format":"1","workbook":"xlsx","n_sheets":2,"sheets":["tabla mundial","tabla general"],"not_rendered":{"charts":0,"images":0,"macros":0,"external_links":1,"defined_names":4,"comments":0,"pivot_tables":0},"unopened":[],"bounds":{"document_bytes":16777216,"sheet_cells":100000,"rows_first":2000,"rows_last":500,"rows_between":2000,"halvings":0,"cell_chars":16384,"cell_head_chars":4096},"cells_cut":0,"cells_raw":0,"read":"whole","date_system":"1900"}

{"sheet":"tabla mundial","index":0,"n_rows":116,"n_cols":21,"rows_kept":116,"cut":false,"hidden":false,"merged":[[46,4,46,9],[6,4,6,9],[14,4,14,9],[22,4,22,9],[30,4,30,9],[38,4,38,9],[110,4,110,9],[115,1,116,6],[54,4,54,9],[62,4,62,9],[74,4,74,9],[90,4,90,9],[99,4,99,9],[105,4,105,9]]}
[]
[null,"Copa mundial de futbol - Brasil 2014"]
[null,null,null,null,"registra los resultados de los partidos en las celdas color verde."]
[null,null,null,null,"Desde octavos de final, si hay empate debes registrar en las columnas F , I"]
[null,null,null,"http://formulasexcel.com"]
[]
[null,"FECHA","HORA","LUGAR","Resultados Grupo A"]
[null,"2014-06-12",0.58333333333333304,"Sao Paulo","Brasil",null,null,null,null,"Croacia",null,"Pos","EQUIPO","Pts","J","G","E","P","GF","GC","D"]
[null,"2014-06-13",0.41666666666666663,"Natal","Mexico",null,null,null,null,"Camerun",null,{"$f":"IF(SUM(O$9:O$12)<>12,\"\",(SUMPRODUCT(((1000*N9+10*U9+S9)< (1000*(N$9:N$12)+10*(U$9:U$12)+(S$9:S$12)))+0)+1))","v":""},"Brasil",{"$f":"(P9*3+Q9*1)","v":0},{"$f":"SUM(P9:R9)","v":0},{"$f":"SUM((E$8:E$13=M9)*(G$8:G$13<>\"\")*(H$8:H$13<>\"\")*(G$8:G$13>H$8:H$13),(J$8:J$13=M9)*(G$8:G$13<>\"\")*(H$8:H$13<>\"\")*(G$8:G$13<H$8:H$13))","v":0},{"$f":"SUM((E$8:E$13=M9)*(G$8:G$13<>\"\")*(G$8:G$13=H$8:H$13),(J$8:J$13=M9)*(H$8:H$13<>\"\")*(G$8:G$13=H$8:H$13))","v":0},{"$f":"SUM((E$8:E$13=M9)*(H$8:H$13<>\"\")*(G$8:G$13<>\"\")*(G$8:G$13<H$8:H$13),(G$8:G$13<>\"\")*(J$8:J$13=M9)*(H$8:H$13<>\"\")*(G$8:G$13>H$8:H$13))","v":0},{"$f":"SUM((E$8:E$13=M9)*(G$8:G$13)*(H$8:H$13<>\"\"),(J$8:J$13=M9)*(H$8:H$13)*(G$8:G$13<>\"\"))","v":0},{"$f":"SUM((E$8:E$13=M9)*(G$8:G$13<>\"\")*(H$8:H$13),(J$8:J$13=M9)*(H$8:H$13<>\"\")*(G$8:G$13))","v":0},{"$f":"S9-T9","v":0}]
[null,"2014-06-17",0.54166666666666663,"Fortaleza","Brasil",null,null,null,null,"Mexico",null,{"$f":"IF(SUM(O$9:O$12)<>12,\"\",(SUMPRODUCT(((1000*N10+10*U10+S10)< (1000*(N$9:N$12)+10*(U$9:U$12)+(S$9:S$12)))+0)+1))","v":""},"Croacia",{"$f":"(P10*3+Q10*1)","v":0},{"$f":"SUM(P10:R10)","v":0},{"$f":"SUM((E$8:E$13=M10)*(G$8:G$13<>\"\")*(H$8:H$13<>\"\")*(G$8:G$13>H$8:H$13),(J$8:J$13=M10)*(G$8:G$13<>\"\")*(H$8:H$13<>\"\")*(G$8:G$13<H$8:H$13))","v":0},{"$f":"SUM((E$8:E$13=M10)*(G$8:G$13<>\"\")*(G$8:G$13=H$8:H$13),(J$8:J$13=M10)*(H$8:H$13<>\"\")*(G$8:G$13=H$8:H$13))","v":0},{"$f":"SUM((E$8:E$13=M10)*(H$8:H$13<>\"\")*(G$8:G$13<>\"\")*(G$8:G$13<H$8:H$13),(G$8:G$13<>\"\")*(J$8:J$13=M10)*(H$8:H$13<>\"\")*(G$8:G$13>H$8:H$13))","v":0},{"$f":"SUM((E$8:E$13=M10)*(G$8:G$13)*(H$8:H$13<>\"\"),(J$8:J$13=M10)*(H$8:H$13)*(G$8:G$13<>\"\"))","v":0},{"$f":"SUM((E$8:E$13=M10)*(G$8:G$13<>\"\")*(H$8:H$13),(J$8:J$13=M10)*(H$8:H$13<>\"\")*(G$8:G$13))","v":0},{"$f":"S10-T10","v":0}]
[null,"2014-06-18",0.5,"Manaus","Camerun",null,null,null,null,"Croacia",null,{"$f":"IF(SUM(O$9:O$12)<>12,\"\",(SUMPRODUCT(((1000*N11+10*U11+S11)< (1000*(N$9:N$12)+10*(U$9:U$12)+(S$9:S$12)))+0)+1))","v":""},"Mexico",{"$f":"(P11*3+Q11*1)","v":0},{"$f":"SUM(P11:R11)","v":0},{"$f":"SUM((E$8:E$13=M11)*(G$8:G$13<>\"\")*(H$8:H$13<>\"\")*(G$8:G$13>H$8:H$13),(J$8:J$13=M11)*(G$8:G$13<>\"\")*(H$8:H$13<>\"\")*(G$8:G$13<H$8:H$13))","v":0},{"$f":"SUM((E$8:E$13=M11)*(G$8:G$13<>\"\")*(G$8:G$13=H$8:H$13),(J$8:J$13=M11)*(H$8:H$13<>\"\")*(G$8:G$13=H$8:H$13))","v":0},{"$f":"SUM((E$8:E$13=M11)*(H$8:H$13<>\"\")*(G$8:G$13<>\"\")*(G$8:G$13<H$8:H$13),(G$8:G$13<>\"\")*(J$8:J$13=M11)*(H$8:H$13<>\"\")*(G$8:G$13>H$8:H$13))","v":0},{"$f":"SUM((E$8:E$13=M11)*(G$8:G$13)*(H$8:H$13<>\"\"),(J$8:J$13=M11)*(H$8:H$13)*(G$8:G$13<>\"\"))","v":0},{"$f":"SUM((E$8:E$13=M11)*(G$8:G$13<>\"\")*(H$8:H$13),(J$8:J$13=M11)*(H$8:H$13<>\"\")*(G$8:G$13))","v":0},{"$f":"S11-T11","v":0}]
[null,"2014-06-23",0.58333333333333304,"Brasilia","Camerun",null,null,null,null,"Brasil",null,{"$f":"IF(SUM(O$9:O$12)<>12,\"\",(SUMPRODUCT(((1000*N12+10*U12+S12)< (1000*(N$9:N$12)+10*(U$9:U$12)+(S$9:S$12)))+0)+1))","v":""},"Camerun",{"$f":"(P12*3+Q12*1)","v":0},{"$f":"SUM(P12:R12)","v":0},{"$f":"SUM((E$8:E$13=M12)*(G$8:G$13<>\"\")*(H$8:H$13<>\"\")*(G$8:G$13>H$8:H$13),(J$8:J$13=M12)*(G$8:G$13<>\"\")*(H$8:H$13<>\"\")*(G$8:G$13<H$8:H$13))","v":0},{"$f":"SUM((E$8:E$13=M12)*(G$8:G$13<>\"\")*(G$8:G$13=H$8:H$13),(J$8:J$13=M12)*(H$8:H$13<>\"\")*(G$8:G$13=H$8:H$13))","v":0},{"$f":"SUM((E$8:E$13=M12)*(H$8:H$13<>\"\")*(G$8:G$13<>\"\")*(G$8:G$13<H$8:H$13),(G$8:G$13<>\"\")*(J$8:J$13=M12)*(H$8:H$13<>\"\")*(G$8:G$13>H$8:H$13))","v":0},{"$f":"SUM((E$8:E$13=M12)*(G$8:G$13)*(H$8:H$13<>\"\"),(J$8:J$13=M12)*(H$8:H$13)*(G$8:G$13<>\"\"))","v":0},{"$f":"SUM((E$8:E$13=M12)*(G$8:G$13<>\"\")*(H$8:H$13),(J$8:J$13=M12)*(H$8:H$13<>\"\")*(G$8:G$13))","v":0},{"$f":"S12-T12","v":0}]
[null,"2014-06-23",0.58333333333333304,"Recife","Croacia",null,null,null,null,"Mexico"]
[]
[null,"FECHA","HORA","LUGAR","Resultados Grupo B"]
{"$rows_left_out":102}
{"sheet":"tabla general","index":1,"n_rows":34,"n_cols":12,"rows_kept":34,"cut":false,"hidden":false,"merged":[]}
[]
["Posición","EQUIPO","RONDA","J","G","E","P","GF","GC","D","GF/P","GC/P"]
[{"$f":"IF($D3=0,\"\",IF(COUNTIF('tabla mundial'!$M$72:$M$87,$B3),IF(INDEX('tabla mundial'!$L$72:$L$87,MATCH($B3,'tabla mundial'!$M$72:$M$87,0))=\"\",\"\",(INDEX('tabla mundial'!$L$72:$L$87,MATCH($B3,'tabla mundial'!$M$72:$M$87,0)))),(IF(LEFT(C3,1)<>\"P\",\"\",(SUMPRODUCT((((LOOKUP(LEFT(C3,1),{\"C\",1000;\"F\",8000;\"O\",500;\"P\",100;\"S\",3000}))*10000+100*D3*E3+30*H3-20*I3+J3)<(10000*((LOOKUP(LEFT(C$3:C$34,1),{\"C\",1000;\"F\",8000;\"O\",500;\"P\",100;\"S\",3000})))+100*(D$3:D$34)*(E$3:E$34)+30*(H$3:H$34)-20*(I$3:I$34)+(J$3:J$34)))+0)+1)))))","v":""},"Alemania",{"$f":"IF(COUNTIF('tabla mundial'!$M$111:$M$112,$B3)=1,\"Final\",IF(COUNTIF('tabla mundial'!$M$100:$M$103,$B3)=1,\"SemiFinal\",IF(COUNTIF('tabla mundial'!$M$90:$M$97,$B3)=1,\"Cuartos de Final\",IF(COUNTIF('tabla mundial'!$M$72:$M$87,$B3)=1,\"Octavos de Final\",\"Primera Ronda\"))))","v":"Primera Ronda"},{"$f":"SUMIF('tabla mundial'!$M$9:$M$112,$B3,'tabla mundial'!O$9:O$112)","v":0},{"$f":"SUMIF('tabla mundial'!$M$9:$M$112,$B3,'tabla mundial'!P$9:P$112)","v":0},{"$f":"SUMIF('tabla mundial'!$M$9:$M$112,$B3,'tabla mundial'!Q$9:Q$112)","v":0},{"$f":"SUMIF('tabla mundial'!$M$9:$M$112,$B3,'tabla mundial'!R$9:R$112)","v":0},{"$f":"SUMIF('tabla mundial'!$M$9:$M$112,$B3,'tabla mundial'!S$9:S$112)","v":0},{"$f":"SUMIF('tabla mundial'!$M$9:$M$112,$B3,'tabla mundial'!T$9:T$112)","v":0},{"$f":"SUMIF('tabla mundial'!$M$9:$M$112,$B3,'tabla mundial'!U$9:U$112)","v":0},{"$f":"IF($D3=0,0,H3/$D3)","v":0},0]
[{"$f":"IF($D4=0,\"\",IF(COUNTIF('tabla mundial'!$M$72:$M$87,$B4),IF(INDEX('tabla mundial'!$L$72:$L$87,MATCH($B4,'tabla mundial'!$M$72:$M$87,0))=\"\",\"\",(INDEX('tabla mundial'!$L$72:$L$87,MATCH($B4,'tabla mundial'!$M$72:$M$87,0)))),(IF(LEFT(C4,1)<>\"P\",\"\",(SUMPRODUCT((((LOOKUP(LEFT(C4,1),{\"C\",1000;\"F\",8000;\"O\",500;\"P\",100;\"S\",3000}))*10000+100*D4*E4+30*H4-20*I4+J4)<(10000*((LOOKUP(LEFT(C$3:C$34,1),{\"C\",1000;\"F\",8000;\"O\",500;\"P\",100;\"S\",3000})))+100*(D$3:D$34)*(E$3:E$34)+30*(H$3:H$34)-20*(I$3:I$34)+(J$3:J$34)))+0)+1)))))","v":""},"Argelia",{"$f":"IF(COUNTIF('tabla mundial'!$M$111:$M$112,$B4)=1,\"Final\",IF(COUNTIF('tabla mundial'!$M$100:$M$103,$B4)=1,\"SemiFinal\",IF(COUNTIF('tabla mundial'!$M$90:$M$97,$B4)=1,\"Cuartos de Final\",IF(COUNTIF('tabla mundial'!$M$72:$M$87,$B4)=1,\"Octavos de Final\",\"Primera Ronda\"))))","v":"Primera Ronda"},{"$f":"SUMIF('tabla mundial'!$M$9:$M$112,$B4,'tabla mundial'!O$9:O$112)","v":0},{"$f":"SUMIF('tabla mundial'!$M$9:$M$112,$B4,'tabla mundial'!P$9:P$112)","v":0},{"$f":"SUMIF('tabla mundial'!$M$9:$M$112,$B4,'tabla mundial'!Q$9:Q$112)","v":0},{"$f":"SUMIF('tabla mundial'!$M$9:$M$112,$B4,'tabla mundial'!R$9:R$112)","v":0},{"$f":"SUMIF('tabla mundial'!$M$9:$M$112,$B4,'tabla mundial'!S$9:S$112)","v":0},{"$f":"SUMIF('tabla mundial'!$M$9:$M$112,$B4,'tabla mundial'!T$9:T$112)","v":0},{"$f":"SUMIF('tabla mundial'!$M$9:$M$112,$B4,'tabla mundial'!U$9:U$112)","v":0},0,0]
[{"$f":"IF($D5=0,\"\",IF(COUNTIF('tabla mundial'!$M$72:$M$87,$B5),IF(INDEX('tabla mundial'!$L$72:$L$87,MATCH($B5,'tabla mundial'!$M$72:$M$87,0))=\"\",\"\",(INDEX('tabla mundial'!$L$72:$L$87,MATCH($B5,'tabla mundial'!$M$72:$M$87,0)))),(IF(LEFT(C5,1)<>\"P\",\"\",(SUMPRODUCT((((LOOKUP(LEFT(C5,1),{\"C\",1000;\"F\",8000;\"O\",500;\"P\",100;\"S\",3000}))*10000+100*D5*E5+30*H5-20*I5+J5)<(10000*((LOOKUP(LEFT(C$3:C$34,1),{\"C\",1000;\"F\",8000;\"O\",500;\"P\",100;\"S\",3000})))+100*(D$3:D$34)*(E$3:E$34)+30*(H$3:H$34)-20*(I$3:I$34)+(J$3:J$34)))+0)+1)))))","v":""},"Argentina",{"$f":"IF(COUNTIF('tabla mundial'!$M$111:$M$112,$B5)=1,\"Final\",IF(COUNTIF('tabla mundial'!$M$100:$M$103,$B5)=1,\"SemiFinal\",IF(COUNTIF('tabla mundial'!$M$90:$M$97,$B5)=1,\"Cuartos de Final\",IF(COUNTIF('tabla mundial'!$M$72:$M$87,$B5)=1,\"Octavos de Final\",\"Primera Ronda\"))))","v":"Primera Ronda"},{"$f":"SUMIF('tabla mundial'!$M$9:$M$112,$B5,'tabla mundial'!O$9:O$112)","v":0},{"$f":"SUMIF('tabla mundial'!$M$9:$M$112,$B5,'tabla mundial'!P$9:P$112)","v":0},{"$f":"SUMIF('tabla mundial'!$M$9:$M$112,$B5,'tabla mundial'!Q$9:Q$112)","v":0},{"$f":"SUMIF('tabla mundial'!$M$9:$M$112,$B5,'tabla mundial'!R$9:R$112)","v":0},{"$f":"SUMIF('tabla mundial'!$M$9:$M$112,$B5,'tabla mundial'!S$9:S$112)","v":0},{"$f":"SUMIF('tabla mundial'!$M$9:$M$112,$B5,'tabla mundial'!T$9:T$112)","v":0},{"$f":"SUMIF('tabla mundial'!$M$9:$M$112,$B5,'tabla mundial'!U$9:U$112)","v":0},0,0]
[{"$f":"IF($D6=0,\"\",IF(COUNTIF('tabla mundial'!$M$72:$M$87,$B6),IF(INDEX('tabla mundial'!$L$72:$L$87,MATCH($B6,'tabla mundial'!$M$72:$M$87,0))=\"\",\"\",(INDEX('tabla mundial'!$L$72:$L$87,MATCH($B6,'tabla mundial'!$M$72:$M$87,0)))),(IF(LEFT(C6,1)<>\"P\",\"\",(SUMPRODUCT((((LOOKUP(LEFT(C6,1),{\"C\",1000;\"F\",8000;\"O\",500;\"P\",100;\"S\",3000}))*10000+100*D6*E6+30*H6-20*I6+J6)<(10000*((LOOKUP(LEFT(C$3:C$34,1),{\"C\",1000;\"F\",8000;\"O\",500;\"P\",100;\"S\",3000})))+100*(D$3:D$34)*(E$3:E$34)+30*(H$3:H$34)-20*(I$3:I$34)+(J$3:J$34)))+0)+1)))))","v":""},"Australia",{"$f":"IF(COUNTIF('tabla mundial'!$M$111:$M$112,$B6)=1,\"Final\",IF(COUNTIF('tabla mundial'!$M$100:$M$103,$B6)=1,\"SemiFinal\",IF(COUNTIF('tabla mundial'!$M$90:$M$97,$B6)=1,\"Cuartos de Final\",IF(COUNTIF('tabla mundial'!$M$72:$M$87,$B6)=1,\"Octavos de Final\",\"Primera Ronda\"))))","v":"Primera Ronda"},{"$f":"SUMIF('tabla mundial'!$M$9:$M$112,$B6,'tabla mundial'!O$9:O$112)","v":0},{"$f":"SUMIF('tabla mundial'!$M$9:$M$112,$B6,'tabla mundial'!P$9:P$112)","v":0},{"$f":"SUMIF('tabla mundial'!$M$9:$M$112,$B6,'tabla mundial'!Q$9:Q$112)","v":0},{"$f":"SUMIF('tabla mundial'!$M$9:$M$112,$B6,'tabla mundial'!R$9:R$112)","v":0},{"$f":"SUMIF('tabla mundial'!$M$9:$M$112,$B6,'tabla mundial'!S$9:S$112)","v":0},{"$f":"SUMIF('tabla mundial'!$M$9:$M$112,$B6,'tabla mundial'!T$9:T$112)","v":0},{"$f":"SUMIF('tabla mundial'!$M$9:$M$112,$B6,'tabla mundial'!U$9:U$112)","v":0},0,0]
[{"$f":"IF($D7=0,\"\",IF(COUNTIF('tabla mundial'!$M$72:$M$87,$B7),IF(INDEX('tabla mundial'!$L$72:$L$87,MATCH($B7,'tabla mundial'!$M$72:$M$87,0))=\"\",\"\",(INDEX('tabla mundial'!$L$72:$L$87,MATCH($B7,'tabla mundial'!$M$72:$M$87,0)))),(IF(LEFT(C7,1)<>\"P\",\"\",(SUMPRODUCT((((LOOKUP(LEFT(C7,1),{\"C\",1000;\"F\",8000;\"O\",500;\"P\",100;\"S\",3000}))*10000+100*D7*E7+30*H7-20*I7+J7)<(10000*((LOOKUP(LEFT(C$3:C$34,1),{\"C\",1000;\"F\",8000;\"O\",500;\"P\",100;\"S\",3000})))+100*(D$3:D$34)*(E$3:E$34)+30*(H$3:H$34)-20*(I$3:I$34)+(J$3:J$34)))+0)+1)))))","v":""},"Belgica",{"$f":"IF(COUNTIF('tabla mundial'!$M$111:$M$112,$B7)=1,\"Final\",IF(COUNTIF('tabla mundial'!$M$100:$M$103,$B7)=1,\"SemiFinal\",IF(COUNTIF('tabla mundial'!$M$90:$M$97,$B7)=1,\"Cuartos de Final\",IF(COUNTIF('tabla mundial'!$M$72:$M$87,$B7)=1,\"Octavos de Final\",\"Primera Ronda\"))))","v":"Primera Ronda"},{"$f":"SUMIF('tabla mundial'!$M$9:$M$112,$B7,'tabla mundial'!O$9:O$112)","v":0},{"$f":"SUMIF('tabla mundial'!$M$9:$M$112,$B7,'tabla mundial'!P$9:P$112)","v":0},{"$f":"SUMIF('tabla mundial'!$M$9:$M$112,$B7,'tabla mundial'!Q$9:Q$112)","v":0},{"$f":"SUMIF('tabla mundial'!$M$9:$M$112,$B7,'tabla mundial'!R$9:R$112)","v":0},{"$f":"SUMIF('tabla mundial'!$M$9:$M$112,$B7,'tabla mundial'!S$9:S$112)","v":0},{"$f":"SUMIF('tabla mundial'!$M$9:$M$112,$B7,'tabla mundial'!T$9:T$112)","v":0},{"$f":"SUMIF('tabla mundial'!$M$9:$M$112,$B7,'tabla mundial'!U$9:U$112)","v":0},0,0]
[{"$f":"IF($D8=0,\"\",IF(COUNTIF('tabla mundial'!$M$72:$M$87,$B8),IF(INDEX('tabla mundial'!$L$72:$L$87,MATCH($B8,'tabla mundial'!$M$72:$M$87,0))=\"\",\"\",(INDEX('tabla mundial'!$L$72:$L$87,MATCH($B8,'tabla mundial'!$M$72:$M$87,0)))),(IF(LEFT(C8,1)<>\"P\",\"\",(SUMPRODUCT((((LOOKUP(LEFT(C8,1),{\"C\",1000;\"F\",8000;\"O\",500;\"P\",100;\"S\",3000}))*10000+100*D8*E8+30*H8-20*I8+J8)<(10000*((LOOKUP(LEFT(C$3:C$34,1),{\"C\",1000;\"F\",8000;\"O\",500;\"P\",100;\"S\",3000})))+100*(D$3:D$34)*(E$3:E$34)+30*(H$3:H$34)-20*(I$3:I$34)+(J$3:J$34)))+0)+1)))))","v":""},"Bosnia-Herzegovina",{"$f":"IF(COUNTIF('tabla mundial'!$M$111:$M$112,$B8)=1,\"Final\",IF(COUNTIF('tabla mundial'!$M$100:$M$103,$B8)=1,\"SemiFinal\",IF(COUNTIF('tabla mundial'!$M$90:$M$97,$B8)=1,\"Cuartos de Final\",IF(COUNTIF('tabla mundial'!$M$72:$M$87,$B8)=1,\"Octavos de Final\",\"Primera Ronda\"))))","v":"Primera Ronda"},{"$f":"SUMIF('tabla mundial'!$M$9:$M$112,$B8,'tabla mundial'!O$9:O$112)","v":0},{"$f":"SUMIF('tabla mundial'!$M$9:$M$112,$B8,'tabla mundial'!P$9:P$112)","v":0},{"$f":"SUMIF('tabla mundial'!$M$9:$M$112,$B8,'tabla mundial'!Q$9:Q$112)","v":0},{"$f":"SUMIF('tabla mundial'!$M$9:$M$112,$B8,'tabla mundial'!R$9:R$112)","v":0},{"$f":"SUMIF('tabla mundial'!$M$9:$M$112,$B8,'tabla mundial'!S$9:S$112)","v":0},{"$f":"SUMIF('tabla mundial'!$M$9:$M$112,$B8,'tabla mundial'!T$9:T$112)","v":0},{"$f":"SUMIF('tabla mundial'!$M$9:$M$112,$B8,'tabla mundial'!U$9:U$112)","v":0},0,0]
[{"$f":"IF($D9=0,\"\",IF(COUNTIF('tabla mundial'!$M$72:$M$87,$B9),IF(INDEX('tabla mundial'!$L$72:$L$87,MATCH($B9,'tabla mundial'!$M$72:$M$87,0))=\"\",\"\",(INDEX('tabla mundial'!$L$72:$L$87,MATCH($B9,'tabla mundial'!$M$72:$M$87,0)))),(IF(LEFT(C9,1)<>\"P\",\"\",(SUMPRODUCT((((LOOKUP(LEFT(C9,1),{\"C\",1000;\"F\",8000;\"O\",500;\"P\",100;\"S\",3000}))*10000+100*D9*E9+30*H9-20*I9+J9)<(10000*((LOOKUP(LEFT(C$3:C$34,1),{\"C\",1000;\"F\",8000;\"O\",500;\"P\",100;\"S\",3000})))+100*(D$3:D$34)*(E$3:E$34)+30*(H$3:H$34)-20*(I$3:I$34)+(J$3:J$34)))+0)+1)))))","v":""},"Brasil",{"$f":"IF(COUNTIF('tabla mundial'!$M$111:$M$112,$B9)=1,\"Final\",IF(COUNTIF('tabla mundial'!$M$100:$M$103,$B9)=1,\"SemiFinal\",IF(COUNTIF('tabla mundial'!$M$90:$M$97,$B9)=1,\"Cuartos de Final\",IF(COUNTIF('tabla mundial'!$M$72:$M$87,$B9)=1,\"Octavos de Final\",\"Primera Ronda\"))))","v":"Primera Ronda"},{"$f":"SUMIF('tabla mundial'!$M$9:$M$112,$B9,'tabla mundial'!O$9:O$112)","v":0},{"$f":"SUMIF('tabla mundial'!$M$9:$M$112,$B9,'tabla mundial'!P$9:P$112)","v":0},{"$f":"SUMIF('tabla mundial'!$M$9:$M$112,$B9,'tabla mundial'!Q$9:Q$112)","v":0},{"$f":"SUMIF('tabla mundial'!$M$9:$M$112,$B9,'tabla mundial'!R$9:R$112)","v":0},{"$f":"SUMIF('tabla mundial'!$M$9:$M$112,$B9,'tabla mundial'!S$9:S$112)","v":0},{"$f":"SUMIF('tabla mundial'!$M$9:$M$112,$B9,'tabla mundial'!T$9:T$112)","v":0},{"$f":"SUMIF('tabla mundial'!$M$9:$M$112,$B9,'tabla mundial'!U$9:U$112)","v":0},0,0]
[{"$f":"IF($D10=0,\"\",IF(COUNTIF('tabla mundial'!$M$72:$M$87,$B10),IF(INDEX('tabla mundial'!$L$72:$L$87,MATCH($B10,'tabla mundial'!$M$72:$M$87,0))=\"\",\"\",(INDEX('tabla mundial'!$L$72:$L$87,MATCH($B10,'tabla mundial'!$M$72:$M$87,0)))),(IF(LEFT(C10,1)<>\"P\",\"\",(SUMPRODUCT((((LOOKUP(LEFT(C10,1),{\"C\",1000;\"F\",8000;\"O\",500;\"P\",100;\"S\",3000}))*10000+100*D10*E10+30*H10-20*I10+J10)<(10000*((LOOKUP(LEFT(C$3:C$34,1),{\"C\",1000;\"F\",8000;\"O\",500;\"P\",100;\"S\",3000})))+100*(D$3:D$34)*(E$3:E$34)+30*(H$3:H$34)-20*(I$3:I$34)+(J$3:J$34)))+0)+1)))))","v":""},"Camerun",{"$f":"IF(COUNTIF('tabla mundial'!$M$111:$M$112,$B10)=1,\"Final\",IF(COUNTIF('tabla mundial'!$M$100:$M$103,$B10)=1,\"SemiFinal\",IF(COUNTIF('tabla mundial'!$M$90:$M$97,$B10)=1,\"Cuartos de Final\",IF(COUNTIF('tabla mundial'!$M$72:$M$87,$B10)=1,\"Octavos de Final\",\"Primera Ronda\"))))","v":"Primera Ronda"},{"$f":"SUMIF('tabla mundial'!$M$9:$M$112,$B10,'tabla mundial'!O$9:O$112)","v":0},{"$f":"SUMIF('tabla mundial'!$M$9:$M$112,$B10,'tabla mundial'!P$9:P$112)","v":0},{"$f":"SUMIF('tabla mundial'!$M$9:$M$112,$B10,'tabla mundial'!Q$9:Q$112)","v":0},{"$f":"SUMIF('tabla mundial'!$M$9:$M$112,$B10,'tabla mundial'!R$9:R$112)","v":0},{"$f":"SUMIF('tabla mundial'!$M$9:$M$112,$B10,'tabla mundial'!S$9:S$112)","v":0},{"$f":"SUMIF('tabla mundial'!$M$9:$M$112,$B10,'tabla mundial'!T$9:T$112)","v":0},{"$f":"SUMIF('tabla mundial'!$M$9:$M$112,$B10,'tabla mundial'!U$9:U$112)","v":0},0,0]
[{"$f":"IF($D11=0,\"\",IF(COUNTIF('tabla mundial'!$M$72:$M$87,$B11),IF(INDEX('tabla mundial'!$L$72:$L$87,MATCH($B11,'tabla mundial'!$M$72:$M$87,0))=\"\",\"\",(INDEX('tabla mundial'!$L$72:$L$87,MATCH($B11,'tabla mundial'!$M$72:$M$87,0)))),(IF(LEFT(C11,1)<>\"P\",\"\",(SUMPRODUCT((((LOOKUP(LEFT(C11,1),{\"C\",1000;\"F\",8000;\"O\",500;\"P\",100;\"S\",3000}))*10000+100*D11*E11+30*H11-20*I11+J11)<(10000*((LOOKUP(LEFT(C$3:C$34,1),{\"C\",1000;\"F\",8000;\"O\",500;\"P\",100;\"S\",3000})))+100*(D$3:D$34)*(E$3:E$34)+30*(H$3:H$34)-20*(I$3:I$34)+(J$3:J$34)))+0)+1)))))","v":""},"Chile",{"$f":"IF(COUNTIF('tabla mundial'!$M$111:$M$112,$B11)=1,\"Final\",IF(COUNTIF('tabla mundial'!$M$100:$M$103,$B11)=1,\"SemiFinal\",IF(COUNTIF('tabla mundial'!$M$90:$M$97,$B11)=1,\"Cuartos de Final\",IF(COUNTIF('tabla mundial'!$M$72:$M$87,$B11)=1,\"Octavos de Final\",\"Primera Ronda\"))))","v":"Primera Ronda"},{"$f":"SUMIF('tabla mundial'!$M$9:$M$112,$B11,'tabla mundial'!O$9:O$112)","v":0},{"$f":"SUMIF('tabla mundial'!$M$9:$M$112,$B11,'tabla mundial'!P$9:P$112)","v":0},{"$f":"SUMIF('tabla mundial'!$M$9:$M$112,$B11,'tabla mundial'!Q$9:Q$112)","v":0},{"$f":"SUMIF('tabla mundial'!$M$9:$M$112,$B11,'tabla mundial'!R$9:R$112)","v":0},{"$f":"SUMIF('tabla mundial'!$M$9:$M$112,$B11,'tabla mundial'!S$9:S$112)","v":0},{"$f":"SUMIF('tabla mundial'!$M$9:$M$112,$B11,'tabla mundial'!T$9:T$112)","v":0},{"$f":"SUMIF('tabla mundial'!$M$9:$M$112,$B11,'tabla mundial'!U$9:U$112)","v":0},0,0]
[{"$f":"IF($D12=0,\"\",IF(COUNTIF('tabla mundial'!$M$72:$M$87,$B12),IF(INDEX('tabla mundial'!$L$72:$L$87,MATCH($B12,'tabla mundial'!$M$72:$M$87,0))=\"\",\"\",(INDEX('tabla mundial'!$L$72:$L$87,MATCH($B12,'tabla mundial'!$M$72:$M$87,0)))),(IF(LEFT(C12,1)<>\"P\",\"\",(SUMPRODUCT((((LOOKUP(LEFT(C12,1),{\"C\",1000;\"F\",8000;\"O\",500;\"P\",100;\"S\",3000}))*10000+100*D12*E12+30*H12-20*I12+J12)<(10000*((LOOKUP(LEFT(C$3:C$34,1),{\"C\",1000;\"F\",8000;\"O\",500;\"P\",100;\"S\",3000})))+100*(D$3:D$34)*(E$3:E$34)+30*(H$3:H$34)-20*(I$3:I$34)+(J$3:J$34)))+0)+1)))))","v":""},"Colombia",{"$f":"IF(COUNTIF('tabla mundial'!$M$111:$M$112,$B12)=1,\"Final\",IF(COUNTIF('tabla mundial'!$M$100:$M$103,$B12)=1,\"SemiFinal\",IF(COUNTIF('tabla mundial'!$M$90:$M$97,$B12)=1,\"Cuartos de Final\",IF(COUNTIF('tabla mundial'!$M$72:$M$87,$B12)=1,\"Octavos de Final\",\"Primera Ronda\"))))","v":"Primera Ronda"},{"$f":"SUMIF('tabla mundial'!$M$9:$M$112,$B12,'tabla mundial'!O$9:O$112)","v":0},{"$f":"SUMIF('tabla mundial'!$M$9:$M$112,$B12,'tabla mundial'!P$9:P$112)","v":0},{"$f":"SUMIF('tabla mundial'!$M$9:$M$112,$B12,'tabla mundial'!Q$9:Q$112)","v":0},{"$f":"SUMIF('tabla mundial'!$M$9:$M$112,$B12,'tabla mundial'!R$9:R$112)","v":0},{"$f":"SUMIF('tabla mundial'!$M$9:$M$112,$B12,'tabla mundial'!S$9:S$112)","v":0},{"$f":"SUMIF('tabla mundial'!$M$9:$M$112,$B12,'tabla mundial'!T$9:T$112)","v":0},{"$f":"SUMIF('tabla mundial'!$M$9:$M$112,$B12,'tabla mundial'!U$9:U$112)","v":0},0,0]
[{"$f":"IF($D13=0,\"\",IF(COUNTIF('tabla mundial'!$M$72:$M$87,$B13),IF(INDEX('tabla mundial'!$L$72:$L$87,MATCH($B13,'tabla mundial'!$M$72:$M$87,0))=\"\",\"\",(INDEX('tabla mundial'!$L$72:$L$87,MATCH($B13,'tabla mundial'!$M$72:$M$87,0)))),(IF(LEFT(C13,1)<>\"P\",\"\",(SUMPRODUCT((((LOOKUP(LEFT(C13,1),{\"C\",1000;\"F\",8000;\"O\",500;\"P\",100;\"S\",3000}))*10000+100*D13*E13+30*H13-20*I13+J13)<(10000*((LOOKUP(LEFT(C$3:C$34,1),{\"C\",1000;\"F\",8000;\"O\",500;\"P\",100;\"S\",3000})))+100*(D$3:D$34)*(E$3:E$34)+30*(H$3:H$34)-20*(I$3:I$34)+(J$3:J$34)))+0)+1)))))","v":""},"Corea del Sur",{"$f":"IF(COUNTIF('tabla mundial'!$M$111:$M$112,$B13)=1,\"Final\",IF(COUNTIF('tabla mundial'!$M$100:$M$103,$B13)=1,\"SemiFinal\",IF(COUNTIF('tabla mundial'!$M$90:$M$97,$B13)=1,\"Cuartos de Final\",IF(COUNTIF('tabla mundial'!$M$72:$M$87,$B13)=1,\"Octavos de Final\",\"Primera Ronda\"))))","v":"Primera Ronda"},{"$f":"SUMIF('tabla mundial'!$M$9:$M$112,$B13,'tabla mundial'!O$9:O$112)","v":0},{"$f":"SUMIF('tabla mundial'!$M$9:$M$112,$B13,'tabla mundial'!P$9:P$112)","v":0},{"$f":"SUMIF('tabla mundial'!$M$9:$M$112,$B13,'tabla mundial'!Q$9:Q$112)","v":0},{"$f":"SUMIF('tabla mundial'!$M$9:$M$112,$B13,'tabla mundial'!R$9:R$112)","v":0},{"$f":"SUMIF('tabla mundial'!$M$9:$M$112,$B13,'tabla mundial'!S$9:S$112)","v":0},{"$f":"SUMIF('tabla mundial'!$M$9:$M$112,$B13,'tabla mundial'!T$9:T$112)","v":0},{"$f":"SUMIF('tabla mundial'!$M$9:$M$112,$B13,'tabla mundial'!U$9:U$112)","v":0},0,0]
[{"$f":"IF($D14=0,\"\",IF(COUNTIF('tabla mundial'!$M$72:$M$87,$B14),IF(INDEX('tabla mundial'!$L$72:$L$87,MATCH($B14,'tabla mundial'!$M$72:$M$87,0))=\"\",\"\",(INDEX('tabla mundial'!$L$72:$L$87,MATCH($B14,'tabla mundial'!$M$72:$M$87,0)))),(IF(LEFT(C14,1)<>\"P\",\"\",(SUMPRODUCT((((LOOKUP(LEFT(C14,1),{\"C\",1000;\"F\",8000;\"O\",500;\"P\",100;\"S\",3000}))*10000+100*D14*E14+30*H14-20*I14+J14)<(10000*((LOOKUP(LEFT(C$3:C$34,1),{\"C\",1000;\"F\",8000;\"O\",500;\"P\",100;\"S\",3000})))+100*(D$3:D$34)*(E$3:E$34)+30*(H$3:H$34)-20*(I$3:I$34)+(J$3:J$34)))+0)+1)))))","v":""},"Costa de Marfil",{"$f":"IF(COUNTIF('tabla mundial'!$M$111:$M$112,$B14)=1,\"Final\",IF(COUNTIF('tabla mundial'!$M$100:$M$103,$B14)=1,\"SemiFinal\",IF(COUNTIF('tabla mundial'!$M$90:$M$97,$B14)=1,\"Cuartos de Final\",IF(COUNTIF('tabla mundial'!$M$72:$M$87,$B14)=1,\"Octavos de Final\",\"Primera Ronda\"))))","v":"Primera Ronda"},{"$f":"SUMIF('tabla mundial'!$M$9:$M$112,$B14,'tabla mundial'!O$9:O$112)","v":0},{"$f":"SUMIF('tabla mundial'!$M$9:$M$112,$B14,'tabla mundial'!P$9:P$112)","v":0},{"$f":"SUMIF('tabla mundial'!$M$9:$M$112,$B14,'tabla mundial'!Q$9:Q$112)","v":0},{"$f":"SUMIF('tabla mundial'!$M$9:$M$112,$B14,'tabla mundial'!R$9:R$112)","v":0},{"$f":"SUMIF('tabla mundial'!$M$9:$M$112,$B14,'tabla mundial'!S$9:S$112)","v":0},{"$f":"SUMIF('tabla mundial'!$M$9:$M$112,$B14,'tabla mundial'!T$9:T$112)","v":0},{"$f":"SUMIF('tabla mundial'!$M$9:$M$112,$B14,'tabla mundial'!U$9:U$112)","v":0},0,0]
[{"$f":"IF($D15=0,\"\",IF(COUNTIF('tabla mundial'!$M$72:$M$87,$B15),IF(INDEX('tabla mundial'!$L$72:$L$87,MATCH($B15,'tabla mundial'!$M$72:$M$87,0))=\"\",\"\",(INDEX('tabla mundial'!$L$72:$L$87,MATCH($B15,'tabla mundial'!$M$72:$M$87,0)))),(IF(LEFT(C15,1)<>\"P\",\"\",(SUMPRODUCT((((LOOKUP(LEFT(C15,1),{\"C\",1000;\"F\",8000;\"O\",500;\"P\",100;\"S\",3000}))*10000+100*D15*E15+30*H15-20*I15+J15)<(10000*((LOOKUP(LEFT(C$3:C$34,1),{\"C\",1000;\"F\",8000;\"O\",500;\"P\",100;\"S\",3000})))+100*(D$3:D$34)*(E$3:E$34)+30*(H$3:H$34)-20*(I$3:I$34)+(J$3:J$34)))+0)+1)))))","v":""},"Costa Rica",{"$f":"IF(COUNTIF('tabla mundial'!$M$111:$M$112,$B15)=1,\"Final\",IF(COUNTIF('tabla mundial'!$M$100:$M$103,$B15)=1,\"SemiFinal\",IF(COUNTIF('tabla mundial'!$M$90:$M$97,$B15)=1,\"Cuartos de Final\",IF(COUNTIF('tabla mundial'!$M$72:$M$87,$B15)=1,\"Octavos de Final\",\"Primera Ronda\"))))","v":"Primera Ronda"},{"$f":"SUMIF('tabla mundial'!$M$9:$M$112,$B15,'tabla mundial'!O$9:O$112)","v":0},{"$f":"SUMIF('tabla mundial'!$M$9:$M$112,$B15,'tabla mundial'!P$9:P$112)","v":0},{"$f":"SUMIF('tabla mundial'!$M$9:$M$112,$B15,'tabla mundial'!Q$9:Q$112)","v":0},{"$f":"SUMIF('tabla mundial'!$M$9:$M$112,$B15,'tabla mundial'!R$9:R$112)","v":0},{"$f":"SUMIF('tabla mundial'!$M$9:$M$112,$B15,'tabla mundial'!S$9:S$112)","v":0},{"$f":"SUMIF('tabla mundial'!$M$9:$M$112,$B15,'tabla mundial'!T$9:T$112)","v":0},{"$f":"SUMIF('tabla mundial'!$M$9:$M$112,$B15,'tabla mundial'!U$9:U$112)","v":0},0,0]
{"$rows_left_out":19}